{"text_format":"3","workbook":"xlsx","n_sheets":2,"sheets":["002  合并  删除后","Sheet1"],"not_rendered":{"images":2,"external_links":1,"defined_names":1},"read":"whole","date_system":"1900"}

{"sheet":"002  合并  删除后","index":0,"n_rows":722,"n_cols":9,"rows_kept":722,"merged":[[0,0,0,8],[721,1,721,8]]}
["需求清单"]
["序号","名称","品牌","单位","规格","数量","单价（元）","小计（元）","备注"]
[1,"0.2-0.5%新洁尔灭",null,"箱","500 mL/瓶，30瓶/箱",2]
[2,"稀醋酸",null,"瓶","500mL",2]
[3,"乙酸钠",null,"瓶","分析纯，500g",3]
[4,"乙酸乙酯",null,"瓶","AR 500ml/瓶",3]
[5,"乙酸乙酯",null,"桶","20升/桶",1]
[6,"乙酰水杨酸",null,"瓶","500g/瓶",2]
[7,"异丙醇",null,"瓶","AR 500ml/瓶",1]
[8,"异戊醇",null,"瓶","分析纯，500mL",3]
[9,"隐性乳房炎快速诊断液（CMT）","CENTRE","瓶","500 mL",3]
[10,"茚三酮",null,"瓶","5g/瓶",2]
[11,"营养琼脂","青岛海博","瓶","250g/瓶",3]
[12,"营养肉汤培养基",null,"瓶",null,5]
[13,"硬度快速测定试剂盒",null,"盒","50次/盒",20]
[14,"伊红美蓝琼脂培养基","青岛海博","瓶","250g/瓶",1]
[15,"0.9%生理盐水",null,"瓶","0.9%，500ml/瓶，30瓶/箱",90]
[16,"0号硬胶囊",null,"袋","500粒",1]
[17,"1%硫酸鱼精蛋白",null,"瓶","10ml",1]
[18,"蔗糖",null,"瓶","分析纯，500g/瓶",3]
[19,"10%硫酸镁",null,"瓶","250g",1]
[20,"10%硝酸铝溶液",null,"瓶","500ml",1]
[21,"正丁醇","国药集团化学试剂有限公司","瓶",null,3]
[22,"酮体含量检测试剂盒(血清、血浆、尿液等)","索莱宝","盒","BC5065-100T/96S","8"]
[23,"亚硫酸氢钠",null,"瓶","500g/瓶",2]
[24,"亚硝酸盐快速测定试剂盒",null,"盒","50次/盒",20]
[25,"胭脂红",null,"瓶","10g/瓶",1]
[26,"研钵带研棒",null,"个",null,6]
[27,"10×DNA上样缓冲液",null,"支","5ml",1]
[28,"10×TBE缓冲液",null,"瓶","分析纯，500mL",2]
[29,"司盘80",null,"袋","500g/瓶",1]
[30,"四丁基溴化铵",null,"瓶","分析纯，50g/瓶",2]
[31,"2，6-二氯靛酚钠",null,"瓶","分析纯，10g",2]
[32,"2.5％解磷啶",null,"盒","5ml/*10支/盒",10]
[33,"硝酸毛果芸香碱",null,"盒",{"v":0.01,"d":"1.00%"},2]
[34,"新城疫弱毒苗",null,"瓶","10mL/瓶",2]
[35,"新城疫血凝试验标准抗原",null,"盒",null,1]
[36,"新城疫血凝试验阳性血清",null,"盒",null,1]
[37,"新城疫阳性血清",null,"瓶","2ml/瓶",2]
[38,"熊果酸",null,"瓶","20mg",1]
[39,"溴化钾溴试液",null,"瓶","500ml",1]
[40,"溴甲酚绿","分析纯，","瓶",{"$f":"VLOOKUP(B42,[1]jss!B$1:I$65536,8,FALSE)","v":"50g"},1]
[41,"溴氰菌酯","2.5%","盒","100ml/40瓶",2]
[42,"无菌脱纤维绵羊全血",null,"瓶","100ml/瓶",2]
[43,"五倍子粉",null,"袋","1kg/袋",2]
[44,"戊二醛",null,"瓶",null,3]
[45,"微生态制剂",null,"袋","2kg/袋",2]
[46,"微生态制剂（益生菌，包括乳酸菌等）",null,"袋","5kg",5]
[47,"维生素B1",null,"瓶","25g/瓶",1]
[48,"维生素K",null,"盒","10mg",2]
[49,"钨酸钠",null,"瓶","分析纯，500g/瓶",1]
[50,"苏木精 - 伊红（HE）染色试剂盒",null,"盒",null,15]
[51,"苏木精-伊红染液",null,"套","250ml+250ml",1]
[52,"苏木素染色液",null,"瓶","100mL/瓶",1]
[53,"苏木素-伊红（H&E）高清","赛维尔","套",null,2]
[54,"饲料级碘酸钙","5%","袋",{"$f":"VLOOKUP(B56,[1]jss!B$1:I$65536,8,FALSE)","v":"500g"},1]
[55,"饲料级硫酸钴","5%","袋",{"$f":"VLOOKUP(B57,[1]jss!B$1:I$65536,8,FALSE)","v":"500g"},1]
[56,"饲料级硫酸锰",null,"袋",{"$f":"VLOOKUP(B58,[1]jss!B$1:I$65536,8,FALSE)","v":"500g"},1]
[57,"饲料级硫酸铜",null,"袋",{"$f":"VLOOKUP(B59,[1]jss!B$1:I$65536,8,FALSE)","v":"500g"},1]
[58,"饲料级硫酸锌",null,"袋",{"$f":"VLOOKUP(B60,[1]jss!B$1:I$65536,8,FALSE)","v":"500g"},1]
[59,"饲料级硫酸亚铁",null,"袋",{"$f":"VLOOKUP(B61,[1]jss!B$1:I$65536,8,FALSE)","v":"500g"},1]
[60,"饲料级亚硒酸钠","5%","袋",{"$f":"VLOOKUP(B62,[1]jss!B$1:I$65536,8,FALSE)","v":"500g"},1]
[61,"双抗",null,"瓶","100mL/瓶",5]
[62,"兔血清",null,"瓶","100mL",4]
[63,"生化试剂盒盘综合检测24项","斯马特","个",null,24]
[64,"生化试剂盘肾功检测7项","斯马特","个",null,24]
[65,"生化试剂盘肾功检测7项","斯马特","盒",null,30]
[66,"生化试剂盘血气电解质13项","斯马特","盒",null,30]
[67,"生化试剂盘综合检测24项","斯马特","盒",null,10]
[68,"生理盐水",null,"瓶","500ml",6]
[69,"十二水合磷酸氢二钠（Na2HPO4·12H2O）",null,"瓶","分析纯，500g/瓶",1]
[70,"十二烷基硫酸钠（SDS）",null,"瓶","分析纯，500g/瓶",1]
[71,"乳糖",null,"瓶","500g/瓶",1]
[72,"瑞氏姬姆萨复合染色液(A液+B液）","baso贝索","套","250ml+250ml",1]
[73,"瑞氏染液",null,"瓶","20ml",8]
[74,"瑞特染料","罗恩",null,"25g",2]
[75,"氢氧化钠滴定液（0.02mol/L）",null,"瓶","1L",1]
[76,"氢氧化钠溶液",null,"瓶","500ml，1mol/L",1]
[77,"氢氧化四甲基铵试液",null,"瓶","500mL",1]
[78,"琼脂粉","青岛海博","瓶","250g",10]
[79,"琼脂糖",null,"瓶","分析纯，500g/瓶",2]
[80,"琼脂糖凝胶DNA回收试剂盒 (增强型)（DP219）",null,"盒","50次",4]
[81,"2X Accurate Taq 预混液（含染料）","艾科瑞","袋","500uL/支，买12支包装的",1]
[82,"台盼蓝",null,"瓶","25 g",4]
[83,"水杨酸","80%","盒","100ml/20瓶",2]
[84,"5%亚硝酸钠溶液",null,"瓶","500mL",1]
[85,"50% 葡萄糖注射液",null,"盒","20mL*5",20]
[86,"50%卵黄乳液","青岛海博","盒","5ml*10",2]
[87,"瘦肉精检测试纸 盐酸克伦特罗检测","智云达","盒","10条/盒",5]
[88,"50×TAE缓冲液（粉剂）",null,"瓶","1L",2]
[89,"石蜡油",null,"瓶","500ml",3]
[90,"Agarose","碧云天","瓶","50g/瓶",2]
[91,"Bovine PROG ELISA Kit试剂盒",null,"盒","96次",1]
[92,"CaCL分析纯",null,"瓶","500g",2]
[93,"DDGS",null,"袋","5kg",3]
[94,"DH5α感受态细胞",null,"支","100微升",10]
[95,"DNA marker",null,"管","分析纯，1mL",1]
[96,"DNA上样缓冲液(6X)","碧云天","支","2mL/瓶",4]
[97,"DNA提取试剂盒","天根","盒","DP304，50次/盒",8]
[98,"EDTA·Na2·H2O",null,"瓶","分析纯，500g/瓶",1]
[99,"ELISA试剂盒（检测猪瘟）",null,"套","48孔，高敏型",1]
[100,"ELISA试剂盒（总黄曲霉素酶免检测试剂盒）",null,"套","48孔，高敏型",1]
[101,"Gel-Red (EB升级换代产品, 10000X)","碧云天","支","0.2mL/支",2]
[102,"GL DNA Marker 1000","艾科瑞","支","500uL/支",1]
[103,"GL DNA Marker 2000","艾科瑞","支","500uL/支",1]
[104,"GL DNA Marker 500","艾科瑞","支","500uL/支",1]
[105,"GoldView II型核酸染料",null,"支","0.5ml",3]
[106,"KCL分析纯",null,"瓶","500g",2]
[107,"LB液体培养基粉末",null,"瓶","分析纯，500g",1]
[108,"L-抗坏血酸标准品",null,"瓶","分析纯，100g",2]
[109,"L-脯氨酸",null,"瓶","25g/瓶",1]
[110,"Marker Ⅲ DNA Ladder\n ",null,"瓶","50T",2]
[111,"Masson染液套装","赛维尔"," 套",null,3,null,null,"货号G1006"]
[112,"MgCl2分析纯",null,"瓶",null,2]
[113,"MH琼脂",null,"瓶","分析，250g",1]
[114,"MH肉汤培养基",null,"瓶","分析，250g",1]
[115,"NaCL分析纯",null,"瓶","500g",2]
[116,"NaH2PO4分析纯",null,"瓶","500g",2]
[117,"NaHCO3分析纯",null,"瓶","500g",2]
[118,"PCR试剂盒","天根","盒","25微升",1]
[119,"pH快速测定试剂盒",null,"盒","50次/盒",20]
[120,"RBC稀释液",null,"瓶",null,6]
[121,"RNAsimple总RNA提取试剂盒(DP419)",null,"盒","50次",4]
[122,"SDS",null,"瓶","分析纯，500g",1]
[123,"SteadyPure 细菌基因组 DNA 提取试剂盒","艾科瑞","盒","50个反应/盒",2]
[124,"TAE（50x）","碧云天","瓶","500mL/瓶",2]
[125,"TE缓冲液",null,"瓶","分析纯，500mL",1]
[126,"Tris",null,"瓶","分析纯，500g/瓶",1]
[127,"TSA培养基HB4114","海博生物","瓶","250g/瓶",1]
[128,"TSA培养基HB7026-9","海博生物","瓶","250g/瓶",1]
[129,"WBC稀释液",null,"瓶",null,6]
[130,"阿司匹林",null,"盒","100mg",2]
[131,"阿维菌素","1%","盒","100ml/20瓶",2]
[132,"阿昔洛韦标准品",null,"g","≥99%",5]
[133,"安痛定",null,"盒","10ml*10支",3]
[134,"安息香",null,"瓶","500g/瓶",2]
[135,"氨氮快速测定试剂盒",null,"盒","50次/盒",20]
[136,"氨基水杨酸钠",null,"瓶","500g/瓶",1]
[137,"氨试液",null,"瓶","250ml",1]
[138,"氨水",null,"瓶","AR 500ml/瓶",6]
[139,"白氨酸",null,null,"5g/瓶",1]
[140,"白凡士林",null,"瓶","500g/瓶",1]
[141,"白鲨10xPBS缓冲液","白鲨","瓶","500mL/瓶",2]
[142,"班氏试剂",null,"瓶","分析纯，500ml",3]
[143,"板蓝根",null,"斤",null,5]
[144,"薄荷脑",null,"瓶","50g/瓶",1]
[145,"苯胺",null,"瓶","AR 500g/瓶",4]
[146,"苯酚",null,"瓶","500g/瓶",1]
[147,"苯甲醛",null,"瓶","500ml/瓶",2]
[148,"苯甲酸",null,"瓶","分析纯，500g/瓶",7]
[149,"吡  啶",null,"瓶","500ml/瓶",4]
[150,"变色硅胶（干燥剂）",null,"kg",null,2]
[151,"标准硫酸钾溶液",null,"瓶","500ml",1]
[152,"标准氯化钠溶液",null,"瓶","100ml",2]
[153,"标准铅溶液",null,"瓶","100ML",2]
[154,"标准铁溶液",null,"瓶","500ml 0.1mol/l",1]
[155,"冰乙酸溶液标准溶液",null,"瓶","500mL",1]
[156,"丙二醛（MDA）检测试剂盒",null,"盒",null,6]
[157,"偏钒酸铵",null,"袋",{"$f":"VLOOKUP(B159,[1]jss!B$1:I$65536,8,FALSE)","v":"500g"},1]
[158,"漂白粉",null,"斤",null,3]
[159,"葡萄糖",null,"瓶",null,6]
[160,"葡萄糖标准溶液",null,"瓶","分析纯，500ml",1]
[161,"葡萄糖分析纯",null,"瓶","500g",2]
[162,"葡萄糖注射液",null,"支"," 100ml:5g",1]
[163,"布病 ELISA 快速检测试纸","微球生命","盒","50个/盒",1]
[164,"布病 ELISA 试剂盒","芬德/微球","盒","96T",3]
[165,"布鲁氏菌病阳性血清",null,"瓶","1ml/瓶",2]
[166,"布氏杆菌病虎红平板凝集试验平板阳性血清",null,"瓶","1 ml/瓶",1]
[167,"布氏杆菌病虎红平板凝集试验诊断抗原抗原",null,"瓶","50 ml/瓶",1]
[168,"菜粕",null,"袋","5kg",3]
[169,"菜籽粕",null,"袋","5kg",1]
[170,"蚕蛹",null,null,"1kg",1]
[171,"草履虫培养基",null,"袋","200mL",1]
[172,"草酸铵","分析纯，",null,{"$f":"VLOOKUP(B174,[1]jss!B$1:I$65536,8,FALSE)","v":"1kg"},1]
[173,"查氏（察氏）培养基","杭州百思","瓶","250g",1]
[174,"超氧化物歧化酶试剂盒",{"$nulls":3},6]
[175,"次粉",null,"袋","5kg",1]
[176,"醋酐",null,"瓶","500ml/瓶2",3]
[177,"醋酸",null,"瓶",{"v":0.01,"d":"1%"},1]
[178,"醋酸铵",null,"瓶","500g/瓶",3]
[179,"醋酸钠",null,"瓶","分析纯，500g",1]
[180,"醋酸泼尼松对照品",null,"瓶","250mg",2]
[181,"醋酸铅",null,"瓶","分析纯，500g",5]
[182,"醋酸盐缓冲液（pH 3.5）",null,"瓶","500ml",1]
[183,"大肠埃希氏菌菌株","青岛海博","支",null,6]
[184,"大肠杆菌成套生化鉴定管","青岛海博","套","4种*4套共16支",7]
[185,"植物油",null,"瓶","500ml/瓶",1]
[186,"质粒小提试剂盒","天根","盒","DP103，50次/盒",1]
[187,"中性福尔马林固定液(10%)","索莱宝","瓶","500mL",6]
[188,"中性树胶","国药集团化学试剂有限公司","瓶",null,1,null,null,"货号10004160"]
[189,"大黄",null,"斤",null,3]
[190,"三氯化铝试液",null,"瓶","250ml",1]
[191,"三氯乙酸",null,"瓶","分析纯，500ml/瓶",3]
[192,"三氧化铝",null,"瓶","250g/瓶",1]
[193,"散气石",null,"个",null,200]
[194,"蛋白胨","青岛海博","瓶","250g",6]
[195,"地改",null,"斤",null,6]
[196,"地克利珠",null,"瓶",null,6]
[197,"迪夫快速染色液"," ","套 ","250ml",7]
[198,"碘 - 碘化钾溶液","阿拉丁 (Aladdin)","瓶","c(I₂)=20g/L, 500ml",3]
[199,"碘标准溶液","0.01mol/L","瓶","AR 500ml/瓶",5]
[200,"碘标准溶液","阿拉丁","瓶","1L",5,null,null,"https://www.chemicalbook.com/SupplyInfo_1739156.htm"]
[201,"碘滴定液",null,"瓶","500ml",1]
[202,"碘-碘化钾溶液",null,"瓶","分析纯，500mL",1]
[203,"碘伏",null,"瓶","500ml/瓶",10]
[204,"碘粒",null,"瓶","250g",1]
[205,"淀粉指示液",null,"瓶","500mL",2]
[206,"糖粉",null,"瓶","500g/瓶",4]
[207,"溶解氧快速测定试剂盒",null,"盒","50次/盒",20]
[208,"肉骨粉",null,null,"1kg",1]
[209,"豆粕",null,"袋","5kg",3]
[210,"对氨基苯甲酸",null,"瓶","500g/瓶",1]
[211,"对二甲氨基苯甲醛",null,"瓶","500g/瓶",1]
[212,"对硝基苯胺",null,"瓶","分析纯，5g/瓶",1]
[213,"对乙酰氨基酚",null,"瓶","500克/瓶",2]
[214,"多聚甲醛固定液",null,"瓶",null,3]
[215,"多矿预混料",null,"袋",{"$f":"VLOOKUP(B217,[1]jss!B$1:I$65536,8,FALSE)","v":"0.5kg"},1]
[216,"多维多矿预混料",null,"袋","5kg",3]
[217,"多维预混料",null,"袋",{"$f":"VLOOKUP(B219,[1]jss!B$1:I$65536,8,FALSE)","v":"0.5kg"},1]
[218,"二苯胺",null,"瓶","分析纯，500g/瓶",2]
[219,"二甲苯","国药集团化学试剂有限公司","瓶",null,5,null,null,"货号10023418"]
[220,"二甲苯溶液",null,"瓶","500ml、/瓶",2]
[221,"二氯甲烷",null,"瓶","分析纯，500mL",30]
[222,"二氧化氯","20%","桶","500g/20袋",1]
[223,"返蓝液","赛维尔","瓶",null,5]
[224,"肥皂",null,"块","雕牌",8]
[225,"斐林试剂",null,"瓶","2×100ml",1]
[226,"分化液","赛维尔","瓶",null,5,null,null,"货号G1039"]
[227,"分离胶/促凝剂PET材质（黄色） 5ml(13*100)","索莱宝","包","YA1271，5 mL 100个/包",2]
[228,"酚酞指示液",null,"瓶","500ml",1]
[229,"蜂蜜",null,"瓶","一瓶",1]
[230,"呋塞米注射液",null,"盒","2ml/*10支/盒",10]
[231,"弗氏完全佐剂","索莱宝","瓶","10mL/瓶",8]
[232,"复合酶制剂",null,"袋","5kg",4]
[233,"香柏油（显微镜油镜）",null,"瓶","25ml",30]
[234,"药用食醋",null,"公斤",null,20]
[235,"甘露醇注射液",null,"瓶","250ml/瓶",2]
[236,"干山楂",null,"袋","500g/袋",3]
[237,"干燥器",null,"个",null,3]
[238,"高纯度质粒小提试剂盒（DP104）",null,"盒","50次",2]
[239,"高清恒染预处理液","赛维尔",null,null,3]
[240,"革兰氏染色液","杭州微生物","盒","10ml*8瓶",10]
[241,"铬黑T指示剂","广州江顺化工","瓶","100g/瓶",1]
[242,"谷丙转氨酶（GPT/ALT）活性检测试剂盒","索莱宝","盒","BC1555-100T/48S",4]
[243,"谷物取样器",null,"个",null,2]
[244,"固体无水硫酸钠",null,"瓶","分析纯，500g",1]
[245,"光合细菌培养基",null,"袋","500g",2]
[246,"硅胶G",null,"瓶","1000g",1]
[247,"硅胶G板",null,"盒","25*75mm80片",2]
[248,"硅胶G板",null,"盒","10cm*10cm",2]
[249,"硅胶G薄层板",null,"盒","10片/盒",4]
[250,"硅胶G粉",null,"瓶","分析纯，500g/瓶",1]
[251,"过氧化氢",null,"瓶","500ml",5]
[252,"过氧化氢酶试剂盒",null,"盒",null,6]
[253,"过氧乙酸","ZHEN HANG","瓶","2.5 L/瓶",5]
[254,"过氧乙酸消毒剂",null,"瓶","5kg/瓶",2]
[255,"还原型抗坏血酸",null,"瓶","分析纯，500g/瓶",1]
[256,"核酸上样缓冲液loading buffer",null,"管","分析纯，1mL",2]
[257,"可溶淀粉","国药","瓶","AR500g",5]
[258,"恒染试剂盒","赛维尔","个",null,2]
[259,"红色乳胶帽（滴瓶滴头帽）",null,"包","50个/包",2]
[260,"葫芦锥子",null,"个",null,5]
[261,"糊精",null,"瓶","500g/瓶",3]
[262,"虎红平板凝集抗原",null,"瓶","10mL/瓶",5]
[263,"琥珀酸酐",null,"瓶","500g/瓶",3]
[264,"槐花药材",null,"袋","500g",1]
[265,"环保型脱蜡透明液","赛维尔",null,null,2,null,null,"货号G1128"]
[266,"黄柏",null,"斤","1000g/袋",2]
[267,"磺胺",null,"瓶","500g/瓶",1]
[268,"磺胺嘧啶","16%+3.6%","盒","100g/10包",2]
[269,"鸡白痢、鸡伤寒沙门氏菌阳性血清",null,"瓶","2ml/瓶",2]
[270,"鸡白痢全血平板凝集多价抗原",null,"瓶","100 ml/瓶",2]
[271,"鸡白痢全血平板凝集实验阳性血清",null,"瓶","2 ml/瓶",2]
[272,"鸡痘冻干活疫苗",null,"瓶","1000羽份/瓶",5]
[273,"鸡法氏囊病毒阳性血清",null,"瓶","2ml/瓶",2]
[274,"鸡法氏囊冻干活疫苗",null,"瓶","1000羽份/瓶",5]
[275,"鸡法氏囊试验阳性血清",null,"瓶","2ml/瓶",1]
[276,"鸡骨剪","德国强力","把","长23cm 型号6565",5]
[277,"鸡沙门氏菌诊断抗原",null,"瓶","2ml/瓶",2]
[278,"鸡新城疫I系冻干疫苗",null,"支","1000羽份/支",20]
[279,"姬姆萨染色液",null,"盒","2*100mL",5]
[280,"记号笔",null,"只","黑色，细",40]
[281,"加拿大树胶",null,"瓶","100mL/瓶",1]
[282,"甲苯",null,"瓶","分析纯，500ml/瓶",1]
[283,"甲醇",null,"瓶","AR 500ml/瓶",60]
[284,"甲酚红","国药集团 (沪试)","瓶","Ind (指示剂级)，25g",1]
[285,"甲基红","分析纯，","瓶",{"$f":"VLOOKUP(B287,[1]jss!B$1:I$65536,8,FALSE)","v":"50g"},1]
[286,"甲酸",null,"瓶","500ml/瓶",1]
[287,"甲硝唑",null,"瓶","50g/瓶",1]
[288,"胶囊板",null,"套","一套",4]
[289,"秸秆发酵剂青贮饲料乳酸菌添加剂玉米秸秆牧草大蒜秧青储发酵菌种",null,"包","20g",2]
[290,"结晶硫酸铜",null,"瓶","分析纯，500g/瓶",1]
[291,"解磷啶（碘解磷定注射液）",null,"瓶",null,"1"]
[292,"金黄色葡萄球菌菌株","青岛海博","支",null,3,null,null,"第二类病原微生物"]
[293,"酒精灯","世泰","个","150ml",30]
[294,"酒石酸",null,"瓶","分析纯，500g/瓶",2]
[295,"酒石酸钾钠","国药","瓶","AR500g",1]
[296,"酒石酸锑钾",null,"瓶","1%%",1]
[297,"聚山梨酯80",null,"瓶","500g/瓶",1]
[298,"聚维酮碘",null,"瓶",null,6]
[299,"考马斯亮蓝G-250染色剂",null,"瓶","分析纯，5g",4]
[300,"考马斯亮蓝染色液",null,"瓶","1g/瓶",1]
[301,"粒粒氧",null,"分",null,5]
[302,"链霉素",null,"盒","50支",5]
[303,"邻二氮菲",null,"瓶","25g",1]
[304,"邻甲苯胺",null,"瓶","分析纯，500mL",4]
[305,"邻硝基苯胺",null,"瓶","分析纯，5g/瓶",1]
[306,"磷酸二氢钠",null,"瓶","500g",2]
[307,"磷酸氢二钠",null,"瓶","500g",2]
[308,"磷酸氢钙",null,"袋","5kg",4]
[309,"硫胺素盐酸盐",null,"瓶","500g/瓶",1]
[310,"硫代硫酸钠","国药","瓶","AR500g",1]
[311,"硫代硫酸钠滴定液",null,"瓶","500ml",1]
[312,"硫代乙酰胺",null,"瓶","500g",1]
[313,"硫脲",null,"瓶","500g(生化试剂:纯度>99%)",3]
[314,"硫氰酸铵溶液（30→100）",null,"瓶","500ml 0.1mol/l",1]
[315,"硫酸阿托品",null,"瓶","5g/瓶",1]
[316,"硫酸阿托品溶液",null,"盒",{"v":0.01,"d":"1.00%"},3]
[317,"硫酸铵","分析纯，","瓶",{"$f":"VLOOKUP(B319,[1]jss!B$1:I$65536,8,FALSE)","v":"500g"},1]
[318,"硫酸钾","化学纯，","瓶",{"$f":"VLOOKUP(B320,[1]jss!B$1:I$65536,8,FALSE)","v":"1kg"},1]
[319,"硫酸链霉素",null,"盒","10g/盒",2,null,null,"抗生素原料药"]
[320,"硫酸镁",null,"瓶",null,3]
[321,"硫酸镁注射液",null,"盒","5ml/*10支/盒",10]
[322,"硫酸锰","聚恒达","瓶","AR500g",1]
[323,"硫酸铁胺（NH4Fe(S04)2·6H20）",null,"瓶","25g/瓶",1]
[324,"硫酸铜","96%","袋","25kg",1]
[325,"硫酸铜","分析纯","瓶","500g",1]
[326,"硫酸锌",null,"瓶","50g/瓶",1]
[327,"硫酸亚铁",null,"瓶",null,3]
[328,"龙胆紫染料",null,"瓶","25g",1]
[329,"卢戈碘液(标准碘液，5%)","索莱宝","瓶","500mL",1,null,null,"https://www.solarbio.com/goodsInfo?id=915"]
[330,"芦丁对照品",null,"盒","100mg",5]
[331,"炉甘石",null,"袋","500g/袋",1]
[332,"鲁戈氏碘液",null,"瓶",null,10]
[333,"氯仿",null,"瓶","分析纯，500mL/瓶",15]
[334,"氯化铵","国药","瓶","AR500g",1]
[335,"氯化钡溶液",null,"瓶","500ml,0.1mol/L",1]
[336,"氯化钙注射液",null,"盒","5ml/*5支/盒",10]
[337,"氯化钾",null,"瓶",null,3]
[338,"氯化镁",null,"瓶",null,3]
[339,"氯化锰","亚泰化工","瓶","AR500g",1]
[340,"氯化三苯四氮唑试液",null,"瓶","10ml",1]
[341,"氯氰菊酯",null,"瓶",null,6]
[342,"马铃薯葡萄糖琼脂（含氯霉素）","青岛海博","瓶","250g",3]
[343,"麦糠凯琼脂培养基","青岛海博","瓶","250g/瓶",1]
[344,"麦氏比浊管","青岛海博","套",null,2]
[345,"麦芽",null,"袋","500g/袋",1]
[346,"棉籽粕",null,"袋","5kg",1]
[347,"免疫多糖",null,"袋","1kg/袋",1]
[348,"明胶",null,"瓶","AR 500g/瓶",1]
[349,"钼酸",null,"瓶","分析纯，500g/瓶",2]
[350,"钼酸铵",null,"瓶","分析纯，500g/瓶",2]
[351,"纳氏试剂","国药沪试","瓶","500ml",5]
[352,"尿素",null,"瓶","分析纯，500g",3]
[353,"尿素",null,"袋","5kg",3]
[354,"尿素苯酚指示剂",null,"瓶",null,3]
[355,"柠檬酸三钠（Na3C6H5O7·2H2O",null,"瓶","分析纯，500g/瓶",1]
[356,"牛肉膏","青岛海博","瓶","250g",5]
[357,"牛血清白蛋白",null,"瓶","5g",2]
[358,"耦合剂/润滑剂",null,"瓶",null,10]
[359,"培养皿","非一次性","套","直径90mm",200]
[360,"培养皿",null,"个","120mm",20]
[361,"皮尺",null,"个",null,8]
[362,"牛保定绳（栓牛）",null,"根",null,8]
[363,"牛鼻钳",null,"个",null,4]
[364,"奶牛乳房炎诊断盘",null,"个",null,10]
[365,"尼龙细绳（直径1cm）",null,"米",null,40]
[366,"纳氏比色管",null,"根","10ml",20]
[367,"磨砂口带盖广口瓶","蜀牛","个","250ml",50]
[368,"磨砂口球形冷凝管",null,"个","磨口24/29",10]
[369,"曝气头",null,"个",null,15]
[370,"铅笔",null,"盒","HB,10只/盒",2]
[371,"铅笔",null,"支","2b",10]
[372,"枪头","Biosharp/白鲨","袋","10 ul/BS-10-T",10]
[373,"枪头","Biosharp/白鲨","袋","200 ul/BS-200-T",10]
[374,"枪头","Biosharp/白鲨","袋","1000 ul/BS-1000-T",10]
[375,"抹布",null,"条","30*70cm 中厚 蓝色",20]
[376,"滤纸","杭州特种纸业有限公司","盒","新星，15 cm，中速，圆形，100张/盒，定性滤纸",10]
[377,"滤纸","杭州特种纸业有限公司","盒","新星，18cm，中速，圆形，100张/盒，定性滤纸",7]
[378,"滤纸（大）",null,"包","60×60cm/100张",4]
[379,"麻布手套",null,"袋","24双",1]
[380,"麻袋",null,"个",null,4]
[381,"麻绳线（实验室捆扎物品）",null,"捆","粗2.8mm,160米",6]
[382,"容量瓶","蜀牛","个","10ml，白色",100]
[383,"容量瓶","蜀牛","个","25ml，白色",100]
[384,"容量瓶","蜀牛","个","50ml，白色",20]
[385,"容量瓶",null,"个","100ml，白色",40]
[386,"容量瓶",null,"个","1000ml，白色",6]
[387,"容量瓶",null,"个","10ml，棕色",20]
[388,"容量瓶",null,"个","25ml，棕色",20]
[389,"容量瓶",null,"个","50ml，棕色",20]
[390,"容量瓶",null,"个","100ml，棕色",10]
[391,"容量瓶",null,"个","250ml，棕色",10]
[392,"容量瓶",null,"个","500ml，棕色",10]
[393,"废液缸",null,"个","500 mL",8]
[394,"量瓶（25ml)",null,"个","25ml",10]
[395,"量瓶（100ml)",null,"个","100ml",10]
[396,"量瓶（1000ml)",null,"个","1000ml",10]
[397,"量筒","玻璃","个","500ml",20]
[398,"量筒",null,"个","5L",15]
{"$rows_left_out":323}
{"sheet":"Sheet1","index":1,"n_rows":1,"n_cols":1,"rows_kept":1}
["危化品"]